BDBM50271317 CHEMBL482700::N-(3-Carbamimidoylsulfanylmethyl-phenyl)-acetamidine
SMILES CC(=N)Nc1cccc(CSC(N)=N)c1
InChI Key InChIKey=NREBOUIAMSLKKW-UHFFFAOYSA-N
Data  1 KI
  Tab Delimited (TSV)   2D SDfile   Computed 3D by Vconf -m prep SDfile
Find this compound or compounds like it in BindingDB:
Activity Spreadsheet -- Enzyme Inhibition Constant Data from BindingDB
Found 1 hit for monomerid = 50271317
TargetNitric oxide synthase, brain(Homo sapiens (Human))
Instituto De QuíMica MéDica
Curated by ChEMBL
LigandPNGBDBM50271317(CHEMBL482700 | N-(3-Carbamimidoylsulfanylmethyl-ph...)
Affinity DataKi:  360nM. Assay description: Inhibition of nNOS (unknown origin) assessed as conversion of L-[3H]arginine to L-[3H]citrulline
In DepthDetails ArticlePubMed