BDBM50271902 CHEMBL4126603
SMILES CN1CCN(CC1)NC(=O)CN1C(=S)S\C(=C/c2ccc(Br)cc2)C1=O
InChI Key InChIKey=BLYQAYFJDHPBNX-UVTDQMKNSA-N
Data  1 IC50
  Tab Delimited (TSV)   2D SDfile   Computed 3D by Vconf -m prep SDfile
Find this compound or compounds like it in BindingDB:
Activity Spreadsheet -- Enzyme Inhibition Constant Data from BindingDB
Found 1 hit for monomerid = 50271902
TargetMetallo-beta-lactamase type 2(Bacillus cereus)
University Of Oxford
Curated by ChEMBL
LigandPNGBDBM50271902(CHEMBL4126603)
Affinity DataIC50: >5.00E+4nM. Assay description: Inhibition of recombinant Bacillus cereus BC2 expressed in Escherichia coli BL21 (DE3) cells using FC4-FC5 as substrate by fluorescence-based assay
In DepthDetails ArticlePubMed