BDBM50271903 CHEMBL3221932
SMILES OC(=O)C(\S)=C\c1ccc(Br)cc1
InChI Key InChIKey=QXTGSYHLHVXDPD-YVMONPNESA-N
Data  1 IC50
  Tab Delimited (TSV)   2D SDfile   Computed 3D by Vconf -m prep SDfile
Find this compound or compounds like it in BindingDB:
Activity Spreadsheet -- Enzyme Inhibition Constant Data from BindingDB
Found 1 hit for monomerid = 50271903
TargetMetallo-beta-lactamase type 2(Bacillus cereus)
University Of Oxford
Curated by ChEMBL
LigandPNGBDBM50271903(CHEMBL3221932)
Affinity DataIC50:  9.90E+3nM. Assay description: Inhibition of recombinant Bacillus cereus BC2 expressed in Escherichia coli BL21 (DE3) cells using FC4-FC5 as substrate by fluorescence-based assay
In DepthDetails ArticlePubMed