BDBM50272643 ((3R,4R)-4-(2-chlorophenoxy)-3,4-dihydro-2H-chromen-3-yl)-N-methylmethanamine::((3R,4R)-4-(2-chlorophenoxy)chroman-3-yl)-N-methylmethanamine::CHEMBL497479
SMILES CNC[C@@H]1COc2ccccc2[C@@H]1Oc1ccccc1Cl
InChI Key InChIKey=DZEOBMAMUUMJNJ-SJKOYZFVSA-N
Data  7 IC50
  Tab Delimited (TSV)   2D SDfile   Computed 3D by Vconf -m prep SDfile
Find this compound or compounds like it in BindingDB:
Activity Spreadsheet -- Enzyme Inhibition Constant Data from BindingDB
Found 7 hits for monomerid = 50272643
TargetSodium-dependent dopamine transporter(Homo sapiens (Human))
Neurocrine Biosciences
Curated by ChEMBL
LigandPNGBDBM50272643(((3R,4R)-4-(2-chlorophenoxy)-3,4-dihydro-2H-chrome...)
Affinity DataIC50: >1.00E+4nM. Assay description: Inhibition of dopamine uptake at human DAT expressed in HEK cells
In DepthDetails ArticlePubMed
TargetSodium-dependent noradrenaline transporter(Homo sapiens (Human))
Neurocrine Biosciences
Curated by ChEMBL
LigandPNGBDBM50272643(((3R,4R)-4-(2-chlorophenoxy)-3,4-dihydro-2H-chrome...)
Affinity DataIC50:  36nM. Assay description: Inhibition of norepinephrine uptake at human NET expressed in HEK cells
In DepthDetails ArticlePubMed
TargetSodium-dependent serotonin transporter(Homo sapiens (Human))
Neurocrine Biosciences
Curated by ChEMBL
LigandPNGBDBM50272643(((3R,4R)-4-(2-chlorophenoxy)-3,4-dihydro-2H-chrome...)
Affinity DataIC50:  6.00E+3nM. Assay description: Inhibition of serotonin uptake at human SERT expressed in HEK cells
In DepthDetails ArticlePubMed
TargetCytochrome P450 2D6(Homo sapiens (Human))
Neurocrine Biosciences
Curated by ChEMBL
LigandPNGBDBM50272643(((3R,4R)-4-(2-chlorophenoxy)-3,4-dihydro-2H-chrome...)
Affinity DataIC50:  1.20E+3nM. Assay description: Inhibition of recombinant CYP32D6
In DepthDetails ArticlePubMed
TargetSodium-dependent serotonin transporter(Homo sapiens (Human))
Neurocrine Biosciences
Curated by ChEMBL
LigandPNGBDBM50272643(((3R,4R)-4-(2-chlorophenoxy)-3,4-dihydro-2H-chrome...)
Affinity DataIC50:  1.60E+3nM. Assay description: Inhibition of serotonin uptake at human SERT expressed in HEK293 cells
In DepthDetails ArticlePubMed
TargetSodium-dependent dopamine transporter(Homo sapiens (Human))
Neurocrine Biosciences
Curated by ChEMBL
LigandPNGBDBM50272643(((3R,4R)-4-(2-chlorophenoxy)-3,4-dihydro-2H-chrome...)
Affinity DataIC50: >1.00E+4nM. Assay description: Inhibition of dopamine uptake at human DAT expressed in HEK293 cells
In DepthDetails ArticlePubMed
TargetSodium-dependent noradrenaline transporter(Homo sapiens (Human))
Neurocrine Biosciences
Curated by ChEMBL
LigandPNGBDBM50272643(((3R,4R)-4-(2-chlorophenoxy)-3,4-dihydro-2H-chrome...)
Affinity DataIC50:  26nM. Assay description: Inhibition of norepinephrine uptake at human NET expressed in HEK293 cells
In DepthDetails ArticlePubMed