BDBM50272688 ((3S,4S)-4-(o-tolyloxy)-3,4-dihydro-1H-isochromen-3-yl)methanamine::((3S,4S)-4-(o-tolyloxy)isochroman-3-yl)methanamine::CHEMBL524798
SMILES Cc1ccccc1O[C@@H]1[C@H](CN)OCc2ccccc12
InChI Key InChIKey=BHTUHPLMWNGSLY-IRXDYDNUSA-N
Data  7 IC50
  Tab Delimited (TSV)   2D SDfile   Computed 3D by Vconf -m prep SDfile
Find this compound or compounds like it in BindingDB:
Activity Spreadsheet -- Enzyme Inhibition Constant Data from BindingDB
Found 7 hits for monomerid = 50272688
TargetSodium-dependent noradrenaline transporter(Homo sapiens (Human))
Neurocrine Biosciences
Curated by ChEMBL
LigandPNGBDBM50272688(((3S,4S)-4-(o-tolyloxy)-3,4-dihydro-1H-isochromen-...)
Affinity DataIC50:  95nM. Assay description: Inhibition of norepinephrine uptake at human NET expressed in HEK cells
In DepthDetails ArticlePubMed
TargetSodium-dependent serotonin transporter(Homo sapiens (Human))
Neurocrine Biosciences
Curated by ChEMBL
LigandPNGBDBM50272688(((3S,4S)-4-(o-tolyloxy)-3,4-dihydro-1H-isochromen-...)
Affinity DataIC50:  6.00E+3nM. Assay description: Inhibition of serotonin uptake at human SERT expressed in HEK cells
In DepthDetails ArticlePubMed
TargetSodium-dependent dopamine transporter(Homo sapiens (Human))
Neurocrine Biosciences
Curated by ChEMBL
LigandPNGBDBM50272688(((3S,4S)-4-(o-tolyloxy)-3,4-dihydro-1H-isochromen-...)
Affinity DataIC50: >1.00E+4nM. Assay description: Inhibition of dopamine uptake at human DAT expressed in HEK cells
In DepthDetails ArticlePubMed
TargetCytochrome P450 2D6(Homo sapiens (Human))
Neurocrine Biosciences
Curated by ChEMBL
LigandPNGBDBM50272688(((3S,4S)-4-(o-tolyloxy)-3,4-dihydro-1H-isochromen-...)
Affinity DataIC50:  4.00E+3nM. Assay description: Inhibition of recombinant CYP32D6
In DepthDetails ArticlePubMed
TargetSodium-dependent serotonin transporter(Homo sapiens (Human))
Neurocrine Biosciences
Curated by ChEMBL
LigandPNGBDBM50272688(((3S,4S)-4-(o-tolyloxy)-3,4-dihydro-1H-isochromen-...)
Affinity DataIC50:  4.00E+3nM. Assay description: Inhibition of serotonin uptake at human SERT expressed in HEK293 cells
In DepthDetails ArticlePubMed
TargetSodium-dependent dopamine transporter(Homo sapiens (Human))
Neurocrine Biosciences
Curated by ChEMBL
LigandPNGBDBM50272688(((3S,4S)-4-(o-tolyloxy)-3,4-dihydro-1H-isochromen-...)
Affinity DataIC50: >1.00E+4nM. Assay description: Inhibition of dopamine uptake at human DAT expressed in HEK293 cells
In DepthDetails ArticlePubMed
TargetSodium-dependent noradrenaline transporter(Homo sapiens (Human))
Neurocrine Biosciences
Curated by ChEMBL
LigandPNGBDBM50272688(((3S,4S)-4-(o-tolyloxy)-3,4-dihydro-1H-isochromen-...)
Affinity DataIC50:  100nM. Assay description: Inhibition of norepinephrine uptake at human NET expressed in HEK293 cells
In DepthDetails ArticlePubMed