BDBM50272749 3-methyl-4-((3S,4S)-3-((methylamino)methyl)-3,4-dihydro-1H-isochromen-4-yloxy)phenol::CHEMBL524313
SMILES CNC[C@@H]1OCc2ccccc2[C@@H]1Oc1ccc(O)cc1C
InChI Key InChIKey=CGROONDICFFSDT-ROUUACIJSA-N
Data  4 IC50
  Tab Delimited (TSV)   2D SDfile   Computed 3D by Vconf -m prep SDfile
Find this compound or compounds like it in BindingDB:
Activity Spreadsheet -- Enzyme Inhibition Constant Data from BindingDB
Found 4 hits for monomerid = 50272749
TargetSodium-dependent noradrenaline transporter(Homo sapiens (Human))
Neurocrine Biosciences
Curated by ChEMBL
LigandPNGBDBM50272749(3-methyl-4-((3S,4S)-3-((methylamino)methyl)-3,4-di...)
Affinity DataIC50:  8nM. Assay description: Inhibition of norepinephrine uptake at human NET expressed in HEK293 cells
In DepthDetails ArticlePubMed
TargetCytochrome P450 2D6(Homo sapiens (Human))
Neurocrine Biosciences
Curated by ChEMBL
LigandPNGBDBM50272749(3-methyl-4-((3S,4S)-3-((methylamino)methyl)-3,4-di...)
Affinity DataIC50:  9.00E+3nM. Assay description: Inhibition of recombinant CYP32D6
In DepthDetails ArticlePubMed
TargetSodium-dependent dopamine transporter(Homo sapiens (Human))
Neurocrine Biosciences
Curated by ChEMBL
LigandPNGBDBM50272749(3-methyl-4-((3S,4S)-3-((methylamino)methyl)-3,4-di...)
Affinity DataIC50: >1.00E+4nM. Assay description: Inhibition of dopamine uptake at human DAT expressed in HEK293 cells
In DepthDetails ArticlePubMed
TargetSodium-dependent serotonin transporter(Homo sapiens (Human))
Neurocrine Biosciences
Curated by ChEMBL
LigandPNGBDBM50272749(3-methyl-4-((3S,4S)-3-((methylamino)methyl)-3,4-di...)
Affinity DataIC50:  35nM. Assay description: Inhibition of serotonin uptake at human SERT expressed in HEK293 cells
In DepthDetails ArticlePubMed