BDBM50273594 CHEMBL446960::N-((1H-indol-2-yl)methyl)-2-phenylethanamine
SMILES C(Cc1ccccc1)NCc1cc2ccccc2[nH]1
InChI Key InChIKey=LMNUEZRZRYCQSM-UHFFFAOYSA-N
Data  3 KI
  Tab Delimited (TSV)   2D SDfile   Computed 3D by Vconf -m prep SDfile
Find this compound or compounds like it in BindingDB:
Activity Spreadsheet -- Enzyme Inhibition Constant Data from BindingDB
Found 1 hit for monomerid = 50273594
TargetAmine oxidase [flavin-containing] A(Homo sapiens (Human))
Bharati Vidyapeeth Deemed University
Curated by ChEMBL
LigandPNGBDBM50273594(CHEMBL446960 | N-((1H-indol-2-yl)methyl)-2-phenyle...)
Affinity DataKi:  6.25E+8nM. Assay description: Inhibition of MAO-A receptor
In DepthDetails ArticlePubMed