BDBM50273854 1-Methoxy-3,4-dihydronaphthalene-2-carboxaldehyde guanylhydrazone::CHEMBL456600
SMILES [#6]-[#8]-[#6]-1=[#6](-[#6]-[#6]-c2ccccc-12)-[#6]=[#7]\[#7]=[#6](\[#7])-[#7]
InChI Key InChIKey=HJRUQCVPHRPUOK-UHFFFAOYSA-N
Data  1 IC50
  Tab Delimited (TSV)   2D SDfile   Computed 3D by Vconf -m prep SDfile
Find this compound or compounds like it in BindingDB:
Activity Spreadsheet -- Enzyme Inhibition Constant Data from BindingDB
Found 1 hit for monomerid = 50273854
TargetGag polyprotein(Avian erythroblastosis virus (strain ES4))
University Of Illinois At Urbana-Champaign
Curated by ChEMBL
LigandPNGBDBM50273854(1-Methoxy-3,4-dihydronaphthalene-2-carboxaldehyde ...)
Affinity DataIC50:  3.10E+3nM. Assay description: Antagonist activity at estrogen receptor alpha (unknown origin) expressed in human HEC1 cells assessed as inhibition of 1 nM estradiol-induced transc...
In DepthDetails ArticlePubMed