BDBM50275018 CHEMBL4126407
SMILES Cc1ccc(Cn2cc(nn2)-c2cnc(C(=O)NCC(O)=O)c(O)c2)cc1C
InChI Key InChIKey=OIRDDOHOPYFFMC-UHFFFAOYSA-N
Data  1 IC50
  Tab Delimited (TSV)   2D SDfile   Computed 3D by Vconf -m prep SDfile
Find this compound or compounds like it in BindingDB:
Activity Spreadsheet -- Enzyme Inhibition Constant Data from BindingDB
Found 1 hit for monomerid = 50275018
TargetEgl nine homolog 1(Homo sapiens (Human))
China Pharmaceutical University
Curated by ChEMBL
LigandPNGBDBM50275018(CHEMBL4126407)
Affinity DataIC50:  278nM. Assay description: Inhibition of HIF-PHD2 (181 to 426 residues) (unknown origin) using FITC-HIF1-alpha (556 to 574 residues) as substrate after 60 mins by fluorescence ...
Ligand InfoMMDBPC cidPC sid
In DepthDetails ArticlePubMed