BDBM50275038 CHEMBL4126257
SMILES OC(=O)CNC(=O)c1ncc(cc1O)-c1cn(nn1)-c1ccccc1
InChI Key InChIKey=PVWKKNBKRFXECJ-UHFFFAOYSA-N
Data  1 IC50
  Tab Delimited (TSV)   2D SDfile   Computed 3D by Vconf -m prep SDfile
Find this compound or compounds like it in BindingDB:
Activity Spreadsheet -- Enzyme Inhibition Constant Data from BindingDB
Found 1 hit for monomerid = 50275038
TargetEgl nine homolog 1(Homo sapiens (Human))
China Pharmaceutical University
Curated by ChEMBL
LigandPNGBDBM50275038(CHEMBL4126257)
Affinity DataIC50:  2.29E+3nM. Assay description: Inhibition of HIF-PHD2 (181 to 426 residues) (unknown origin) using FITC-HIF1-alpha (556 to 574 residues) as substrate after 60 mins by fluorescence ...
In DepthDetails ArticlePubMed