BDBM50275086 CHEMBL4129500
SMILES COc1ccc(Cn2cc(nn2)-c2cnc(C(=O)NCC(O)=O)c(O)c2)cc1
InChI Key InChIKey=MKJXMLBIXFXWKI-UHFFFAOYSA-N
Data  1 IC50
  Tab Delimited (TSV)   2D SDfile   Computed 3D by Vconf -m prep SDfile
Find this compound or compounds like it in BindingDB:
Activity Spreadsheet -- Enzyme Inhibition Constant Data from BindingDB
Found 1 hit for monomerid = 50275086
TargetEgl nine homolog 1(Homo sapiens (Human))
China Pharmaceutical University
Curated by ChEMBL
LigandPNGBDBM50275086(CHEMBL4129500)
Affinity DataIC50:  281nM. Assay description: Inhibition of HIF-PHD2 (181 to 426 residues) (unknown origin) using FITC-HIF1-alpha (556 to 574 residues) as substrate after 60 mins by fluorescence ...
In DepthDetails ArticlePubMed