BDBM50275103 CHEMBL4128528
SMILES COC(=O)CNC(=O)c1ncc(cc1O)-c1cn(Cc2ccccc2)nn1
InChI Key InChIKey=OMRYYLWKJHISCY-UHFFFAOYSA-N
Data  1 IC50
  Tab Delimited (TSV)   2D SDfile   Computed 3D by Vconf -m prep SDfile
Find this compound or compounds like it in BindingDB:
Activity Spreadsheet -- Enzyme Inhibition Constant Data from BindingDB
Found 1 hit for monomerid = 50275103
TargetEgl nine homolog 1(Homo sapiens (Human))
China Pharmaceutical University
Curated by ChEMBL
LigandPNGBDBM50275103(CHEMBL4128528)
Affinity DataIC50:  5.53E+3nM. Assay description: Inhibition of HIF-PHD2 (181 to 426 residues) (unknown origin) using FITC-HIF1-alpha (556 to 574 residues) as substrate after 60 mins by fluorescence ...
In DepthDetails ArticlePubMed