BDBM50275385 2-(5-(4-Chlorophenyl)-1-(2,4-dichlorophenyl)-4-methyl-1Hpyrazol-3-yl)-5-(1-(trifluoromethyl)cyclopropyl)-1,3,4-oxadiazole::CHEMBL487773
SMILES Cc1c(nn(c1-c1ccc(Cl)cc1)-c1ccc(Cl)cc1Cl)-c1nnc(o1)C1(CC1)C(F)(F)F
InChI Key InChIKey=YVWOKNLLSSRNEZ-UHFFFAOYSA-N
Data  1 IC50
  Tab Delimited (TSV)   2D SDfile   Computed 3D by Vconf -m prep SDfile
Find this compound or compounds like it in BindingDB:
Activity Spreadsheet -- Enzyme Inhibition Constant Data from BindingDB
Found 1 hit for monomerid = 50275385
TargetCannabinoid receptor 1(Rattus norvegicus (rat))
Green Cross
Curated by ChEMBL
LigandPNGBDBM50275385(2-(5-(4-Chlorophenyl)-1-(2,4-dichlorophenyl)-4-met...)
Affinity DataIC50:  8.53nM. Assay description: Displacement of [3H]CP55940 from CB1 receptor in Sprague-Dawley rat cerebellum by liquid scintillation spectrometry
In DepthDetails ArticlePubMed