BDBM50275387 2-Benzyl-5-(5-(4-chlorophenyl)-1-(2,4-dichlorophenyl)-4-methyl-1H-pyrazol-3-yl)-1,3,4-oxadiazole::CHEMBL519400
SMILES Cc1c(nn(c1-c1ccc(Cl)cc1)-c1ccc(Cl)cc1Cl)-c1nnc(Cc2ccccc2)o1
InChI Key InChIKey=FYKVMCCSKWMERC-UHFFFAOYSA-N
Data  1 IC50
  Tab Delimited (TSV)   2D SDfile   Computed 3D by Vconf -m prep SDfile
Find this compound or compounds like it in BindingDB:
Activity Spreadsheet -- Enzyme Inhibition Constant Data from BindingDB
Found 1 hit for monomerid = 50275387
TargetCannabinoid receptor 1(Rattus norvegicus (rat))
Green Cross
Curated by ChEMBL
LigandPNGBDBM50275387(2-Benzyl-5-(5-(4-chlorophenyl)-1-(2,4-dichlorophen...)
Affinity DataIC50:  19.2nM. Assay description: Displacement of [3H]CP55940 from CB1 receptor in Sprague-Dawley rat cerebellum by liquid scintillation spectrometry
In DepthDetails ArticlePubMed