BDBM50275400 CHEMBL487162::Methyl 1-(3-(5-tert-Butyl-1,3,4-oxadiazol-2-yl)-5-(4-chlorophenyl)-1-(2,4-dichlorophenyl)-1H-pyrazol-4-yl)ethylcarbamate
SMILES COC(=O)NC(C)c1c(nn(c1-c1ccc(Cl)cc1)-c1ccc(Cl)cc1Cl)-c1nnc(o1)C(C)(C)C
InChI Key InChIKey=NWBHBTKCUROIPP-UHFFFAOYSA-N
Data  2 IC50
  Tab Delimited (TSV)   2D SDfile   Computed 3D by Vconf -m prep SDfile
Find this compound or compounds like it in BindingDB:
Activity Spreadsheet -- Enzyme Inhibition Constant Data from BindingDB
Found 2 hits for monomerid = 50275400
TargetCannabinoid receptor 1(Rattus norvegicus (rat))
Green Cross
Curated by ChEMBL
LigandPNGBDBM50275400(CHEMBL487162 | Methyl 1-(3-(5-tert-Butyl-1,3,4-oxa...)
Affinity DataIC50:  9nM. Assay description: Displacement of [3H]CP55940 from CB1 receptor in Sprague-Dawley rat cerebellum by liquid scintillation spectrometry
In DepthDetails ArticlePubMed
TargetCannabinoid receptor 2(Homo sapiens (Human))
Green Cross
Curated by ChEMBL
LigandPNGBDBM50275400(CHEMBL487162 | Methyl 1-(3-(5-tert-Butyl-1,3,4-oxa...)
Affinity DataIC50: >1.00E+4nM. Assay description: Displacement of [3H]WIN55212-2 from human CB2 receptor expressed in CHOK1 cells by liquid scintillation spectrometry
In DepthDetails ArticlePubMed