BDBM50275409 2-(4-((1H-Pyrazol-1-yl)methyl)-5-(4-chlorophenyl)-1-(2,4-dichlorophenyl)-1H-pyrazol-3-yl)-5-tert-butyl-1,3,4-oxadiazole::CHEMBL521382
SMILES CC(C)(C)c1nnc(o1)-c1nn(c(c1Cn1cccn1)-c1ccc(Cl)cc1)-c1ccc(Cl)cc1Cl
InChI Key InChIKey=OXFSTZBYJHAFAT-UHFFFAOYSA-N
Data  2 IC50
  Tab Delimited (TSV)   2D SDfile   Computed 3D by Vconf -m prep SDfile
Find this compound or compounds like it in BindingDB:
Activity Spreadsheet -- Enzyme Inhibition Constant Data from BindingDB
Found 2 hits for monomerid = 50275409
TargetCannabinoid receptor 1(Rattus norvegicus (rat))
Green Cross
Curated by ChEMBL
LigandPNGBDBM50275409(2-(4-((1H-Pyrazol-1-yl)methyl)-5-(4-chlorophenyl)-...)
Affinity DataIC50:  20.5nM. Assay description: Displacement of [3H]CP55940 from CB1 receptor in Sprague-Dawley rat cerebellum by liquid scintillation spectrometry
In DepthDetails ArticlePubMed
TargetCannabinoid receptor 2(Homo sapiens (Human))
Green Cross
Curated by ChEMBL
LigandPNGBDBM50275409(2-(4-((1H-Pyrazol-1-yl)methyl)-5-(4-chlorophenyl)-...)
Affinity DataIC50:  979nM. Assay description: Displacement of [3H]WIN55212-2 from human CB2 receptor expressed in CHOK1 cells by liquid scintillation spectrometry
In DepthDetails ArticlePubMed