BDBM50275460 2-tert-Butyl-5-(5-(4-chlorophenyl)-1-(2,4-dichlorophenyl)-4-(fluoromethyl)-1H-pyrazol-3-yl)-1,3,4-oxadiazole::CHEMBL485753
SMILES CC(C)(C)c1nnc(o1)-c1nn(c(c1CF)-c1ccc(Cl)cc1)-c1ccc(Cl)cc1Cl
InChI Key InChIKey=VTEQLISOOFUJJG-UHFFFAOYSA-N
Data  2 IC50
  Tab Delimited (TSV)   2D SDfile   Computed 3D by Vconf -m prep SDfile
Find this compound or compounds like it in BindingDB:
Activity Spreadsheet -- Enzyme Inhibition Constant Data from BindingDB
Found 2 hits for monomerid = 50275460
TargetCannabinoid receptor 1(Rattus norvegicus (rat))
Green Cross
Curated by ChEMBL
LigandPNGBDBM50275460(2-tert-Butyl-5-(5-(4-chlorophenyl)-1-(2,4-dichloro...)
Affinity DataIC50:  14.7nM. Assay description: Displacement of [3H]CP55940 from CB1 receptor in Sprague-Dawley rat cerebellum by liquid scintillation spectrometry
In DepthDetails ArticlePubMed
TargetCannabinoid receptor 2(Homo sapiens (Human))
Green Cross
Curated by ChEMBL
LigandPNGBDBM50275460(2-tert-Butyl-5-(5-(4-chlorophenyl)-1-(2,4-dichloro...)
Affinity DataIC50:  1.12E+3nM. Assay description: Displacement of [3H]WIN55212-2 from human CB2 receptor expressed in CHOK1 cells by liquid scintillation spectrometry
In DepthDetails ArticlePubMed