BDBM50275988 CHEMBL469938::naphthalen-2-yl 2-phenylethenesulfonate
SMILES O=S(=O)(Oc1ccc2ccccc2c1)\C=C\c1ccccc1
InChI Key InChIKey=LATGHFGQZUSPBC-OUKQBFOZSA-N
Data  1 IC50
  Tab Delimited (TSV)   2D SDfile   Computed 3D by Vconf -m prep SDfile
Find this compound or compounds like it in BindingDB:
Activity Spreadsheet -- Enzyme Inhibition Constant Data from BindingDB
Found 1 hit for monomerid = 50275988
TargetPeroxisome proliferator-activated receptor gamma(Homo sapiens (Human))
National Health Research Institutes
Curated by ChEMBL
LigandPNGBDBM50275988(CHEMBL469938 | naphthalen-2-yl 2-phenylethenesulfo...)
Affinity DataIC50:  1.09E+3nM. Assay description: Displacement of [3H]BRL49653 from PPARgamma (unknown origin) ligand binding domain by scintillation proximity assay
In DepthDetails ArticlePubMed