BDBM50276332 4-((2S,5S,11S,14S)-1-amino-11-(3-amino-3-oxopropyl)-14-(4-((2-(6-hydroxy-3-oxo-3H-xanthen-9-yl)-5-isothiocyanatobenzamido)methyl)benzamido)-2-(hydroxymethyl)-5-isobutyl-1,4,7,10,13-pentaoxo-3,6,9,12-tetraazapentadecan-15-yl)phenyl dihydrogen phosphate::CHEMBL449070
SMILES CC(C)C[C@H](NC(=O)CNC(=O)[C@H](CCC(N)=O)NC(=O)[C@H](Cc1ccc(OP(O)(O)=O)cc1)NC(=O)c1ccc(CNC(=O)c2cc(ccc2-c2c3ccc(O)cc3oc3cc(=O)ccc23)N=C=S)cc1)C(=O)N[C@@H](CO)C(N)=O
InChI Key InChIKey=SCLJLQUVKYSNDL-MXGQMUSSSA-N
Data  1 Kd
  Tab Delimited (TSV)   2D SDfile   Computed 3D by Vconf -m prep SDfile
Find this compound or compounds like it in BindingDB:
Activity Spreadsheet -- Enzyme Inhibition Constant Data from BindingDB
Found 1 hit for monomerid = 50276332
TargetSHC-transforming protein 1(Homo sapiens (Human))
National Cancer Institute-Frederick
Curated by ChEMBL
LigandPNGBDBM50276332(4-((2S,5S,11S,14S)-1-amino-11-(3-amino-3-oxopropyl...)
Affinity DataKd:  1.23E+4nM. Assay description: Binding affinity to Shc Src homology 2 domain (unknown origin) by fluorescence anisotropy
In DepthDetails ArticlePubMed