BDBM50276489 1-(4-amino-2,6-diisopropylphenyl)-3-((4-(3-methoxyphenyl)-1-(4-methoxyphenyl)piperidin-4-yl)methyl)urea dihydrochloride::CHEMBL364823::CHEMBL574940
SMILES COc1ccc(cc1)N1CCC(CNC(=O)Nc2c(cc(N)cc2C(C)C)C(C)C)(CC1)c1cccc(OC)c1
InChI Key InChIKey=VEWHTKWFEUYDMR-UHFFFAOYSA-N
Data  2 IC50
  Tab Delimited (TSV)   2D SDfile   Computed 3D by Vconf -m prep SDfile
Find this compound or compounds like it in BindingDB:
Activity Spreadsheet -- Enzyme Inhibition Constant Data from BindingDB
Found 2 hits for monomerid = 50276489
TargetSterol O-acyltransferase 1(Rattus norvegicus)
Dainippon Sumitomo Pharma
Curated by ChEMBL
LigandPNGBDBM50276489(1-(4-amino-2,6-diisopropylphenyl)-3-((4-(3-methoxy...)
Affinity DataIC50:  142nM. Assay description: Inhibition of ACAT in rat macrophages assessed as incorporation of extracellular [3H]-oleic acid-BSA complex into the intracellular cholesteryl ester...
In DepthDetails ArticlePubMed
TargetSterol O-acyltransferase 1(Homo sapiens (Human))
Dainippon Sumitomo Pharma
Curated by ChEMBL
LigandPNGBDBM50276489(1-(4-amino-2,6-diisopropylphenyl)-3-((4-(3-methoxy...)
Affinity DataIC50:  142nM. Assay description: Inhibition of ACAT in human HepG2 cells
In DepthDetails ArticlePubMed