BDBM50277647 CHEMBL4165841
SMILES COc1ccc(Nc2nccc(n2)-c2cn(C)c3ccccc23)c(OC)c1
InChI Key InChIKey=RELLPRKUGXVDBP-UHFFFAOYSA-N
Data  2 KI
  Tab Delimited (TSV)   2D SDfile   Computed 3D by Vconf -m prep SDfile
Find this compound or compounds like it in BindingDB:
Activity Spreadsheet -- Enzyme Inhibition Constant Data from BindingDB
Found 2 hits for monomerid = 50277647
TargetMAP kinase-interacting serine/threonine-protein kinase 2(Homo sapiens (Human))
University Of South Australia
Curated by ChEMBL
LigandPNGBDBM50277647(CHEMBL4165841)
Affinity DataKi:  610nM. Assay description: Binding affinity determined against ETA receptor in porcine aortic smooth muscle membrane
In DepthDetails ArticlePubMed
TargetMAP kinase-interacting serine/threonine-protein kinase 1(Homo sapiens (Human))
University Of South Australia
Curated by ChEMBL
LigandPNGBDBM50277647(CHEMBL4165841)
Affinity DataKi:  940nM. Assay description: Inhibition of recombinant full length human N-terminal GST-tagged MNK1 expressed in insect cells using N-terminal TAMRA-labeled eIF4E (202 to 214 res...
In DepthDetails ArticlePubMed