BDBM50277797 1-(3-(4-octylphenoxy)-2-oxopropyl)-1H-benzo[d]imidazole-6-carboxylic acid::CHEMBL520836
SMILES CCCCCCCCc1ccc(OCC(=O)Cn2cnc3ccc(cc23)C(O)=O)cc1
InChI Key InChIKey=UWHDUBNIULVHHP-UHFFFAOYSA-N
Data  3 IC50
  Tab Delimited (TSV)   2D SDfile   Computed 3D by Vconf -m prep SDfile
Find this compound or compounds like it in BindingDB:
Activity Spreadsheet -- Enzyme Inhibition Constant Data from BindingDB
Found 3 hits for monomerid = 50277797
TargetCytosolic phospholipase A2(Homo sapiens (Human))
University Of M£Nster
Curated by ChEMBL
LigandPNGBDBM50277797(1-(3-(4-octylphenoxy)-2-oxopropyl)-1H-benzo[d]imid...)
Affinity DataIC50:  85nM. Assay description: Inhibition of cPLA2 from human platelets by RP-HPLC
In DepthDetails ArticlePubMed
TargetCytosolic phospholipase A2(Homo sapiens (Human))
University Of M£Nster
Curated by ChEMBL
LigandPNGBDBM50277797(1-(3-(4-octylphenoxy)-2-oxopropyl)-1H-benzo[d]imid...)
Affinity DataIC50:  85nM. Assay description: Inhibition of cPLA2 in human platelets assessed as arachidonic acid release
In DepthDetails ArticlePubMed
TargetFatty-acid amide hydrolase 1 [30-579](Rattus norvegicus (rat))
University Of M£Nster
Curated by ChEMBL
LigandPNGBDBM50277797(1-(3-(4-octylphenoxy)-2-oxopropyl)-1H-benzo[d]imid...)
Affinity DataIC50:  3.10E+3nM. Assay description: Inhibition of FAAH from rat brain microsomes by RP-HPLC
In DepthDetails ArticlePubMed