BDBM50279696 CHEMBL4173889
SMILES [#6]-[#6](-[#6])-[#6@H](-[#7])-[#6][Se;v2]c1ccc(cc1)S([#7])(=O)=O
InChI Key InChIKey=CWGQZOZRIOMZFO-LLVKDONJSA-N
Data  5 KI
  Tab Delimited (TSV)   2D SDfile   Computed 3D by Vconf -m prep SDfile
Find this compound or compounds like it in BindingDB:
Activity Spreadsheet -- Enzyme Inhibition Constant Data from BindingDB
Found 5 hits for monomerid = 50279696
TargetCarbonic anhydrase 2(Homo sapiens (Human))
University Of Florence
Curated by ChEMBL
LigandPNGBDBM50279696(CHEMBL4173889)
Affinity DataKi:  0.510nM. Assay description: Inhibition of recombinant human carbonic anhydrase 2 incubated for 15 mins by stopped flow CO2 hydrase assay
In DepthDetails ArticlePubMed
TargetCarbonic anhydrase 9(Homo sapiens (Human))
University Of Florence
Curated by ChEMBL
LigandPNGBDBM50279696(CHEMBL4173889)
Affinity DataKi:  2.40nM. Assay description: Inhibition of recombinant human carbonic anhydrase 9 incubated for 15 mins by stopped flow CO2 hydrase assay
In DepthDetails ArticlePubMed
TargetCarbonic anhydrase 7(Homo sapiens (Human))
University Of Florence
Curated by ChEMBL
LigandPNGBDBM50279696(CHEMBL4173889)
Affinity DataKi:  36nM. Assay description: Inhibition of recombinant human carbonic anhydrase 7 incubated for 15 mins by stopped flow CO2 hydrase assay
In DepthDetails ArticlePubMed
TargetCarbonic anhydrase 1(Homo sapiens (Human))
University Of Florence
Curated by ChEMBL
LigandPNGBDBM50279696(CHEMBL4173889)
Affinity DataKi:  93nM. Assay description: Inhibition of recombinant human carbonic anhydrase 1 incubated for 15 mins by stopped flow CO2 hydrase assay
In DepthDetails ArticlePubMed
TargetCarbonic anhydrase 4(Homo sapiens (Human))
University Of Florence
Curated by ChEMBL
LigandPNGBDBM50279696(CHEMBL4173889)
Affinity DataKi:  2.32E+3nM. Assay description: Inhibition of recombinant human carbonic anhydrase 4 incubated for 15 mins by stopped flow CO2 hydrase assay
In DepthDetails ArticlePubMed