BDBM50279768 (2-{2-Benzyloxy-4-[2-benzyloxy-4-(2-benzyloxy-5-carboxymethoxy-4-hydroxymethyl-benzyl)-5-carboxymethoxy-benzyl]-5-carboxymethoxy-benzyl}-4-hydroxy-phenoxy)-acetic acid::CHEMBL216442
SMILES OCc1cc(OCc2ccccc2)c(Cc2cc(OCc3ccccc3)c(Cc3cc(OCc4ccccc4)c(Cc4cc(O)ccc4OCC(O)=O)cc3OCC(O)=O)cc2OCC(O)=O)cc1OCC(O)=O
InChI Key InChIKey=GMCMNMQYJYMZGJ-UHFFFAOYSA-N
Data  3 KI
  Tab Delimited (TSV)   2D SDfile   Computed 3D by Vconf -m prep SDfile
Find this compound or compounds like it in BindingDB:
Activity Spreadsheet -- Enzyme Inhibition Constant Data from BindingDB
Found 3 hits for monomerid = 50279768
TargetNeutrophil elastase(Homo sapiens (Human))
RhôNe-Poulenc Rorer
Curated by ChEMBL
LigandPNGBDBM50279768((2-{2-Benzyloxy-4-[2-benzyloxy-4-(2-benzyloxy-5-ca...)
Affinity DataKi:  8.30E+3nM. Assay description: Inhibitory activity against human leukocyte elastase
In DepthDetails ArticlePubMed
TargetProthrombin(Homo sapiens (Human))
RhôNe-Poulenc Rorer
Curated by ChEMBL
LigandPNGBDBM50279768((2-{2-Benzyloxy-4-[2-benzyloxy-4-(2-benzyloxy-5-ca...)
Affinity DataKi: >1.50E+4nMpH: 7.5Assay Description:Inhibition of thrombin at pH 7.5 in HEPES buffer containing 200 mM NaCl with substrate Bz-Phe-Val-Arg-pNA.
In DepthDetails ArticlePubMed
TargetCathepsin G(Homo sapiens (Human))
RhôNe-Poulenc Rorer
Curated by ChEMBL
LigandPNGBDBM50279768((2-{2-Benzyloxy-4-[2-benzyloxy-4-(2-benzyloxy-5-ca...)
Affinity DataKi: >1.50E+4nMpH: 7.5Assay Description:Inhibition of cathepsin G at pH 7.5 in HEPES buffer containing 200 mM NaCl with substrate Suc-Ala-Ala-Pro-Phe-pNA.
In DepthDetails ArticlePubMed