BDBM50280867 2-(6,13-dimethyl-5-oxo-6,7,12,13-tetrahydro-5H-indolo[2,3-a]pyrrolo[3,4-c]carbazol-12-yl)ethyl cyanide::CHEMBL61753
SMILES CN1Cc2c(C1=O)c1c3ccccc3n(C)c1c1n(CCC#N)c3ccccc3c21
InChI Key InChIKey=ONNADZZVJAPZJC-UHFFFAOYSA-N
Data  4 IC50
  Tab Delimited (TSV)   2D SDfile   Computed 3D by Vconf -m prep SDfile
Find this compound or compounds like it in BindingDB:
Activity Spreadsheet -- Enzyme Inhibition Constant Data from BindingDB
Found 4 hits for monomerid = 50280867
TargetcAMP-dependent protein kinase catalytic subunit alpha(Bos taurus (bovine))
TBA
Curated by ChEMBL
LigandPNGBDBM50280867(2-(6,13-dimethyl-5-oxo-6,7,12,13-tetrahydro-5H-ind...)
Affinity DataIC50: >3.00E+4nM. Assay description: In vitro for inhibitory activity against cAMP-dependent protein kinase from bovine heart (A-kinase)
In DepthDetails Article
LigandPNGBDBM50280867(2-(6,13-dimethyl-5-oxo-6,7,12,13-tetrahydro-5H-ind...)
Affinity DataIC50: >3.00E+4nM. Assay description: In vitro for inhibitory activity against protein kinase C from rat brain
In DepthDetails Article
TargetcGMP-dependent protein kinase 1(Bos taurus (bovine))
TBA
Curated by ChEMBL
LigandPNGBDBM50280867(2-(6,13-dimethyl-5-oxo-6,7,12,13-tetrahydro-5H-ind...)
Affinity DataIC50: >3.00E+4nM. Assay description: In vitro for inhibitory activity against cGMP-dependent protein kinase from bovine lung (G-kinase)
In DepthDetails Article
TargetMyosin light chain kinase, smooth muscle(Gallus gallus (chicken))
TBA
Curated by ChEMBL
LigandPNGBDBM50280867(2-(6,13-dimethyl-5-oxo-6,7,12,13-tetrahydro-5H-ind...)
Affinity DataIC50: >1.00E+4nM. Assay description: In vitro for inhibitory activity against myosin light-chain kinase from chicken gizzard (M-kinase)
In DepthDetails Article