BDBM50280976 5-Benzo[1,3]dioxol-5-yl-6,7-dimethyl-naphtho[2,3-d][1,3]dioxole::CHEMBL303524
SMILES Cc1cc2cc3OCOc3cc2c(c1C)-c1ccc2OCOc2c1
InChI Key InChIKey=NYQYXBLZRVXDMH-UHFFFAOYSA-N
Data  1 IC50
  Tab Delimited (TSV)   2D SDfile   Computed 3D by Vconf -m prep SDfile
Find this compound or compounds like it in BindingDB:
Activity Spreadsheet -- Enzyme Inhibition Constant Data from BindingDB
Found 1 hit for monomerid = 50280976
TargetPolyunsaturated fatty acid 5-lipoxygenase(Homo sapiens (Human))
TBA
Curated by ChEMBL
LigandPNGBDBM50280976(5-Benzo[1,3]dioxol-5-yl-6,7-dimethyl-naphtho[2,3-d...)
Affinity DataIC50:  250nM. Assay description: Compound was evaluated in vitro for inhibition of LTB4 biosynthesis by human leukocytes
In DepthDetails Article