BDBM50280978 6-Methoxy-4-phenyl-3H-naphtho[2,3-c]furan-1-one::CHEMBL64350
SMILES COc1ccc2cc3C(=O)OCc3c(-c3ccccc3)c2c1
InChI Key InChIKey=JVZFVSJOGZTOJQ-UHFFFAOYSA-N
Data  1 IC50
  Tab Delimited (TSV)   2D SDfile   Computed 3D by Vconf -m prep SDfile
Find this compound or compounds like it in BindingDB:
Activity Spreadsheet -- Enzyme Inhibition Constant Data from BindingDB
Found 1 hit for monomerid = 50280978
TargetPolyunsaturated fatty acid 5-lipoxygenase(Homo sapiens (Human))
TBA
Curated by ChEMBL
LigandPNGBDBM50280978(6-Methoxy-4-phenyl-3H-naphtho[2,3-c]furan-1-one | ...)
Affinity DataIC50:  670nM. Assay description: Compound was evaluated in vitro for inhibition of LTB4 biosynthesis by human leukocytes
In DepthDetails Article