BDBM50280979 9-Phenyl-8H-furo[3',4':6,7]naphtho[2,3-d][1,3]dioxol-6-one::CHEMBL64914
SMILES O=C1OCc2c1cc1cc3OCOc3cc1c2-c1ccccc1
InChI Key InChIKey=YTAYUFJSQCIUKR-UHFFFAOYSA-N
Data  1 IC50
  Tab Delimited (TSV)   2D SDfile   Computed 3D by Vconf -m prep SDfile
Find this compound or compounds like it in BindingDB:
Activity Spreadsheet -- Enzyme Inhibition Constant Data from BindingDB
Found 1 hit for monomerid = 50280979
TargetPolyunsaturated fatty acid 5-lipoxygenase(Homo sapiens (Human))
TBA
Curated by ChEMBL
LigandPNGBDBM50280979(9-Phenyl-8H-furo[3',4':6,7]naphtho[2,3-d][1,3]diox...)
Affinity DataIC50:  160nM. Assay description: Compound was evaluated in vitro for inhibition of LTB4 biosynthesis by human leukocytes
In DepthDetails Article