BDBM50282364 3-(4-Fluoro-phenyl)-2-{pentanoyl-[2'-(1H-tetrazol-5-yl)-biphenyl-4-ylmethyl]-amino}-propionic acid::CHEMBL115783
SMILES CCCCC(=O)N(Cc1ccc(cc1)-c1ccccc1-c1nnn[nH]1)C(Cc1ccc(F)cc1)C(O)=O
InChI Key InChIKey=HFMATXSUPNSWTN-UHFFFAOYSA-N
Data  1 IC50
  Tab Delimited (TSV)   2D SDfile   Computed 3D by Vconf -m prep SDfile
Find this compound or compounds like it in BindingDB:
Activity Spreadsheet -- Enzyme Inhibition Constant Data from BindingDB
Found 1 hit for monomerid = 50282364
TargetType-1 angiotensin II receptor(Homo sapiens (Human))
TBA
Curated by ChEMBL
LigandPNGBDBM50282364(3-(4-Fluoro-phenyl)-2-{pentanoyl-[2'-(1H-tetrazol-...)
Affinity DataIC50:  30nM. Assay description: Tested for inhibition of Angiotensin II receptor, type 1 in the absence of bovine serum albumin (BSA)
In DepthDetails Article