BDBM50283476 CHEMBL78562::Phenyl methyl borinic acid
SMILES CB(O)c1ccccc1
InChI Key InChIKey=AUWBRSDXARJHOJ-UHFFFAOYSA-N
Data  1 KI
  Tab Delimited (TSV)   2D SDfile   Computed 3D by Vconf -m prep SDfile
Find this compound or compounds like it in BindingDB:
Activity Spreadsheet -- Enzyme Inhibition Constant Data from BindingDB
Found 1 hit for monomerid = 50283476
TargetChymotrypsinogen A(Bos taurus (bovine))
TBA
Curated by ChEMBL
LigandPNGBDBM50283476(CHEMBL78562 | Phenyl methyl borinic acid)
Affinity DataKi:  3.00E+4nM. Assay description: Compound was tested for the inhibition of chymotrypsin
In DepthDetails Article