BDBM50283496 CHEMBL4169911
SMILES [H][C@@]1(CS1)[C@H](CC1CCC1)C(O)=O
InChI Key InChIKey=SATBRUMVAPRFBK-JGVFFNPUSA-N
Data  2 IC50
  Tab Delimited (TSV)   2D SDfile   Computed 3D by Vconf -m prep SDfile
Find this compound or compounds like it in BindingDB:
Activity Spreadsheet -- Enzyme Inhibition Constant Data from BindingDB
Found 2 hits for monomerid = 50283496
TargetCarboxypeptidase A1(Bos taurus (bovine))
University Of Notre Dame
Curated by ChEMBL
LigandPNGBDBM50283496(CHEMBL4169911)
Affinity DataIC50:  6.00E+4nM. Assay description: Inhibition of bovine carboxypeptidase A using N-(4-methoxyphenylazoformyl)-Phe-OH as substrate preincubated for 2 mins followed by susbtrate addition...
In DepthDetails ArticlePubMed
TargetCarboxypeptidase A1(Bos taurus (bovine))
University Of Notre Dame
Curated by ChEMBL
LigandPNGBDBM50283496(CHEMBL4169911)
Affinity DataIC50:  970nM. Assay description: Inhibition of bovine carboxypeptidase A using N-(4-methoxyphenylazoformyl)-Phe-OH as substrate preincubated for 3 hrs followed by susbtrate addition ...
In DepthDetails ArticlePubMed