BDBM50284234 2-(2,6-Dimethyl-phenyl)-5-(2,2-diphenyl-ethyl)-2,4-dihydro-pyrazol-3-one::CHEMBL267305
SMILES Cc1cccc(C)c1-n1[nH]c(CC(c2ccccc2)c2ccccc2)cc1=O
InChI Key InChIKey=UKQIPWMVLBZOJP-UHFFFAOYSA-N
Data  1 IC50
  Tab Delimited (TSV)   2D SDfile   Computed 3D by Vconf -m prep SDfile
Find this compound or compounds like it in BindingDB:
Activity Spreadsheet -- Enzyme Inhibition Constant Data from BindingDB
Found 1 hit for monomerid = 50284234
TargetAcyl-CoA:cholesterol acyltransferase(Oryctolagus cuniculus)
TBA
Curated by ChEMBL
LigandPNGBDBM50284234(2-(2,6-Dimethyl-phenyl)-5-(2,2-diphenyl-ethyl)-2,4...)
Affinity DataIC50:  5.08E+4nM. Assay description: In vitro Acyl coenzyme A:cholesterol acyltransferase inhibition by incubation with [14C]-oleolyl-CoA and intestinal microsomes isolated from choleste...
In DepthDetails Article