BDBM50286703 1,2,3,4-Tetrahydro-quinoline-5-carboxylic acid [(1R,2R)-3-(2-tert-butylcarbamoyl-phenyl)-2-hydroxy-1-(naphthalen-2-ylsulfanylmethyl)-propyl]-amide::CHEMBL353119
SMILES CC(C)(C)NC(=O)c1ccccc1C[C@@H](O)[C@H](CSc1ccc2ccccc2c1)NC(=O)c1cccc2NCCCc12
InChI Key InChIKey=VMKVRKIHZQAUDC-AJQTZOPKSA-N
Data  1 KI
  Tab Delimited (TSV)   2D SDfile   Computed 3D by Vconf -m prep SDfile
Find this compound or compounds like it in BindingDB:
Activity Spreadsheet -- Enzyme Inhibition Constant Data from BindingDB
Found 1 hit for monomerid = 50286703
TargetGag-Pol polyprotein [489-587](Human immunodeficiency virus type 1)
TBA
Curated by ChEMBL
LigandPNGBDBM50286703(1,2,3,4-Tetrahydro-quinoline-5-carboxylic acid [(1...)
Affinity DataKi:  24nM. Assay description: Inhibitory activity HIV-1 protease enzyme
In DepthDetails Article