BDBM50286710 1H-Indole-4-carboxylic acid [(1R,2R)-3-(2-tert-butylcarbamoyl-phenyl)-2-hydroxy-1-(naphthalen-2-ylsulfanylmethyl)-propyl]-amide::CHEMBL352143
SMILES CC(C)(C)NC(=O)c1ccccc1C[C@@H](O)[C@H](CSc1ccc2ccccc2c1)NC(=O)c1cccc2[nH]ccc12
InChI Key InChIKey=FVMWPRRZZWVRPK-IOWSJCHKSA-N
Data  1 KI
  Tab Delimited (TSV)   2D SDfile   Computed 3D by Vconf -m prep SDfile
Find this compound or compounds like it in BindingDB:
Activity Spreadsheet -- Enzyme Inhibition Constant Data from BindingDB
Found 1 hit for monomerid = 50286710
TargetGag-Pol polyprotein [489-587](Human immunodeficiency virus type 1)
TBA
Curated by ChEMBL
LigandPNGBDBM50286710(1H-Indole-4-carboxylic acid [(1R,2R)-3-(2-tert-but...)
Affinity DataKi:  164nM. Assay description: Inhibitory activity HIV-1 protease enzyme
In DepthDetails Article