BDBM50286713 3,5-Diamino-N-[(1R,2R)-3-(2-tert-butylcarbamoyl-phenyl)-2-hydroxy-1-(naphthalen-2-ylsulfanylmethyl)-propyl]-2-methyl-benzamide::AG-1282::CHEMBL351437
SMILES Cc1c(N)cc(N)cc1C(=O)N[C@@H](CSc1ccc2ccccc2c1)[C@H](O)Cc1ccccc1C(=O)NC(C)(C)C
InChI Key InChIKey=CYNNSHFNMNJCFN-XZWHSSHBSA-N
Data  1 KI
  Tab Delimited (TSV)   2D SDfile   Computed 3D by Vconf -m prep SDfile
Find this compound or compounds like it in BindingDB:
Activity Spreadsheet -- Enzyme Inhibition Constant Data from BindingDB
Found 1 hit for monomerid = 50286713
TargetGag-Pol polyprotein [489-587](Human immunodeficiency virus type 1)
TBA
Curated by ChEMBL
LigandPNGBDBM50286713(3,5-Diamino-N-[(1R,2R)-3-(2-tert-butylcarbamoyl-ph...)
Affinity DataKi:  5nM. Assay description: Inhibitory activity HIV-1 protease enzyme
In DepthDetails Article