BDBM50286783 CHEMBL4159607
SMILES C\C(CN)=C\CN(C[C@H]1Cc2ccccc2CN1)[C@H]1CCCc2cccnc12
InChI Key InChIKey=BASXCEHVMKEGCB-CWHOZVNYSA-N
Data  4 IC50
  Tab Delimited (TSV)   2D SDfile   Computed 3D by Vconf -m prep SDfile
Find this compound or compounds like it in BindingDB:
Activity Spreadsheet -- Enzyme Inhibition Constant Data from BindingDB
Found 4 hits for monomerid = 50286783
TargetMuscarinic acetylcholine receptor M3(Homo sapiens (Human))
Emory University
Curated by ChEMBL
LigandPNGBDBM50286783(CHEMBL4159607)
Affinity DataIC50:  32nM. Assay description: Antagonist activity at mAChR M3 in human CCRF-CEM cells assessed as inhibition of acetylcholine-mediated calcium flux incubated for 25 mins followed ...
In DepthDetails ArticlePubMed
TargetCytochrome P450 3A4(Homo sapiens (Human))
Emory University
Curated by ChEMBL
LigandPNGBDBM50286783(CHEMBL4159607)
Affinity DataIC50: >2.00E+4nM. Assay description: Inhibition of CYP3A4 (unknown origin) using BFC as substrate
In DepthDetails ArticlePubMed
TargetCytochrome P450 2D6(Homo sapiens (Human))
Emory University
Curated by ChEMBL
LigandPNGBDBM50286783(CHEMBL4159607)
Affinity DataIC50: <27nM. Assay description: Inhibition of recombinant human CYP2D6 expressed in insect microsomes using AMMC as substrate preincubated for 30 mins followed by NADPH addition mea...
In DepthDetails ArticlePubMed
TargetC-X-C chemokine receptor type 4(Homo sapiens (Human))
Emory University
Curated by ChEMBL
LigandPNGBDBM50286783(CHEMBL4159607)
Affinity DataIC50:  8.60nM. Assay description: Antagonist activity at CXCR4 in human CCRF-CEM cells assessed as inhibition of CXCL12-mediated calcium flux incubated for 25 mins followed by CXCL12 ...
In DepthDetails ArticlePubMed