BDBM50287399 CHEMBL43912::Quinoline-4-carboxylic acid [(2R,4S)-2-benzyl-1-(3,5-dichloro-benzoyl)-piperidin-4-yl]-amide
SMILES Clc1cc(Cl)cc(c1)C(=O)N1CC[C@@H](C[C@H]1Cc1ccccc1)NC(=O)c1ccnc2ccccc12
InChI Key InChIKey=IDKSGROGHXKFIS-BJKOFHAPSA-N
Data  4 IC50
  Tab Delimited (TSV)   2D SDfile   Computed 3D by Vconf -m prep SDfile
Find this compound or compounds like it in BindingDB:
Activity Spreadsheet -- Enzyme Inhibition Constant Data from BindingDB
Found 4 hits for monomerid = 50287399
TargetSubstance-P receptor(Homo sapiens (Human))
TBA
Curated by ChEMBL
LigandPNGBDBM50287399(CHEMBL43912 | Quinoline-4-carboxylic acid [(2R,4S)...)
Affinity DataIC50:  48nM. Assay description: Compound was tested for inhibition of NK1 receptor from gerbil midbrain
In DepthDetails Article
TargetSubstance-P receptor(Homo sapiens (Human))
TBA
Curated by ChEMBL
LigandPNGBDBM50287399(CHEMBL43912 | Quinoline-4-carboxylic acid [(2R,4S)...)
Affinity DataIC50:  48nM. Assay description: Inhibition of [3H]-SP radioligand binding to NK1 receptor from bovine retina
In DepthDetails Article
TargetSubstance-K receptor(Bos taurus)
TBA
Curated by ChEMBL
LigandPNGBDBM50287399(CHEMBL43912 | Quinoline-4-carboxylic acid [(2R,4S)...)
Affinity DataIC50:  4.50E+3nM. Assay description: Compound was tested for inhibition of [125I]-NKA radioligand binding to NK2 receptor from bovine bladder
In DepthDetails Article
TargetNeuromedin-K receptor(Homo sapiens (Human))
TBA
Curated by ChEMBL
LigandPNGBDBM50287399(CHEMBL43912 | Quinoline-4-carboxylic acid [(2R,4S)...)
Affinity DataIC50:  3.30E+3nM. Assay description: Compound was tested for inhibition of [125I]-Eledoisin radioligand binding to NK3 receptor from gerbil cortex
In DepthDetails Article