BDBM50288566 CHEMBL105560::{(2R,4S)-2-(3,4-Dichloro-benzyl)-4-[(quinolin-4-ylmethyl)-amino]-piperidin-1-yl}-(3,5-dimethyl-phenyl)-methanone
SMILES Cc1cc(C)cc(c1)C(=O)N1CC[C@@H](C[C@H]1Cc1ccc(Cl)c(Cl)c1)NCc1ccnc2ccccc12
InChI Key InChIKey=SXKVOXCVLIJCBZ-IZZNHLLZSA-N
Data  1 IC50
  Tab Delimited (TSV)   2D SDfile   Computed 3D by Vconf -m prep SDfile
Find this compound or compounds like it in BindingDB:
Activity Spreadsheet -- Enzyme Inhibition Constant Data from BindingDB
Found 1 hit for monomerid = 50288566
TargetSubstance-P receptor(Homo sapiens (Human))
TBA
Curated by ChEMBL
LigandPNGBDBM50288566(CHEMBL105560 | {(2R,4S)-2-(3,4-Dichloro-benzyl)-4-...)
Affinity DataIC50:  9nM. Assay description: Binding affinity against NK1 receptor by displacement of [3H]-SP from bovine retina membranes
In DepthDetails Article