BDBM50288575 (3,5-Dimethyl-phenyl)-{(2R,4S)-2-naphthalen-1-ylmethyl-4-[(quinolin-4-ylmethyl)-amino]-piperidin-1-yl}-methanone::CHEMBL323317
SMILES Cc1cc(C)cc(c1)C(=O)N1CC[C@@H](C[C@H]1Cc1cccc2ccccc12)NCc1ccnc2ccccc12
InChI Key InChIKey=BINXDUAGTLDZSD-IOWSJCHKSA-N
Data  1 IC50
  Tab Delimited (TSV)   2D SDfile   Computed 3D by Vconf -m prep SDfile
Find this compound or compounds like it in BindingDB:
Activity Spreadsheet -- Enzyme Inhibition Constant Data from BindingDB
Found 1 hit for monomerid = 50288575
TargetSubstance-P receptor(Homo sapiens (Human))
TBA
Curated by ChEMBL
LigandPNGBDBM50288575((3,5-Dimethyl-phenyl)-{(2R,4S)-2-naphthalen-1-ylme...)
Affinity DataIC50:  29nM. Assay description: Binding affinity against NK1 receptor by displacement of [3H]-SP from bovine retina membranes
In DepthDetails Article