BDBM50289612 CHEMBL46170::[3-Methyl-5-(4,5,7-trifluoro-benzothiazol-2-ylmethyl)-phenyl]-acetic acid
SMILES Cc1cc(CC(O)=O)cc(Cc2nc3c(F)c(F)cc(F)c3s2)c1
InChI Key InChIKey=BEGJKQPWVJRBPU-UHFFFAOYSA-N
Data  1 IC50
  Tab Delimited (TSV)   2D SDfile   Computed 3D by Vconf -m prep SDfile
Find this compound or compounds like it in BindingDB:
Activity Spreadsheet -- Enzyme Inhibition Constant Data from BindingDB
Found 1 hit for monomerid = 50289612
TargetAldo-keto reductase family 1 member B1(Sus scrofa)
TBA
Curated by ChEMBL
LigandPNGBDBM50289612(CHEMBL46170 | [3-Methyl-5-(4,5,7-trifluoro-benzoth...)
Affinity DataIC50:  9.60nM. Assay description: Inhibitory concentration against porcine lens aldose reductase (AR) with DL-glyceraldehyde as the substrate
In DepthDetails Article