BDBM50289613 CHEMBL44743::{Phenyl-[3-(4,5,7-trifluoro-benzothiazol-2-yl)-propionyl]-amino}-acetic acid
SMILES OC(=O)CN(C(=O)CCc1nc2c(F)c(F)cc(F)c2s1)c1ccccc1
InChI Key InChIKey=ITQKUFCAMFKABI-UHFFFAOYSA-N
Data  1 IC50
  Tab Delimited (TSV)   2D SDfile   Computed 3D by Vconf -m prep SDfile
Find this compound or compounds like it in BindingDB:
Activity Spreadsheet -- Enzyme Inhibition Constant Data from BindingDB
Found 1 hit for monomerid = 50289613
TargetAldo-keto reductase family 1 member B1(Sus scrofa)
TBA
Curated by ChEMBL
LigandPNGBDBM50289613(CHEMBL44743 | {Phenyl-[3-(4,5,7-trifluoro-benzothi...)
Affinity DataIC50:  8.30nM. Assay description: Inhibitory concentration against porcine lens aldose reductase (AR) with DL-glyceraldehyde as the substrate
In DepthDetails Article