BDBM50290469 5-[3-amino(imino)methylaminopropyl]-3-[1-cyclohexylmethyl-2-oxo-2-spiro[2,3-dihydro-1H-indene-1,4'-(hexahydropyridine)]-1-yl-(1R)-ethyl]-(5R)-tetrahydro-1H-2,4-imidazoledione::CHEMBL68555
SMILES NC(=N)NCCCc1[nH]c(=O)n([C@H](CC2CCCCC2)C(=O)N2CCC3(CCc4ccccc34)CC2)c1O
InChI Key InChIKey=HFQAJCLWAWVVHC-XMMPIXPASA-N
Data  2 IC50
  Tab Delimited (TSV)   2D SDfile   Computed 3D by Vconf -m prep SDfile
Find this compound or compounds like it in BindingDB:
Activity Spreadsheet -- Enzyme Inhibition Constant Data from BindingDB
Found 2 hits for monomerid = 50290469
TargetC5a anaphylatoxin chemotactic receptor 1(Homo sapiens (Human))
TBA
Curated by ChEMBL
LigandPNGBDBM50290469(5-[3-amino(imino)methylaminopropyl]-3-[1-cyclohexy...)
Affinity DataIC50:  25nM. Assay description: Tested for the ability to compete with [125I]-CO13 ([125I]-Y-F-K-A-Cha-G-L-dF-R) for binding to C5a anaphylatoxin chemotactic receptor from human neu...
In DepthDetails Article
TargetC5a anaphylatoxin chemotactic receptor 1(Homo sapiens (Human))
TBA
Curated by ChEMBL
LigandPNGBDBM50290469(5-[3-amino(imino)methylaminopropyl]-3-[1-cyclohexy...)
Affinity DataIC50:  300nM. Assay description: Tested for its ability to compete with [125I]C5a for binding to C5a anaphylatoxin chemotactic receptor of human neutrophil membrane preparations
In DepthDetails Article