BDBM50292399 7,9-tetradecadiynoic acid::CHEMBL501307
SMILES CCCCC#CC#CCCCCCC(O)=O
InChI Key InChIKey=UDDQRZKIDJCZJF-UHFFFAOYSA-N
Data  1 IC50
  Tab Delimited (TSV)   2D SDfile   Computed 3D by Vconf -m prep SDfile
Find this compound or compounds like it in BindingDB:
Activity Spreadsheet -- Enzyme Inhibition Constant Data from BindingDB
Found 1 hit for monomerid = 50292399
Target3-hydroxy-3-methylglutaryl-coenzyme A reductase(Homo sapiens (Human))
TBA
Curated by ChEMBL
LigandPNGBDBM50292399(7,9-tetradecadiynoic acid | CHEMBL501307)
Affinity DataIC50:  3.00E+3nM. Assay description: Inhibition of human HMGCoA reductase
In DepthDetails Article