BDBM50293265 CHEMBL4162640
SMILES Cl.Cl.NC(=N)\N=C(/N)N1CCN(CC1)c1ncccn1
InChI Key InChIKey=FTFCVYKEAHCEKR-UHFFFAOYSA-N
Data  2 EC50
  Tab Delimited (TSV)   2D SDfile   Computed 3D by Vconf -m prep SDfile
Find this compound or compounds like it in BindingDB:
Activity Spreadsheet -- Enzyme Inhibition Constant Data from BindingDB
Found 2 hits for monomerid = 50293265
TargetTrace amine-associated receptor 5(Mus musculus)
University Of Genoa
Curated by ChEMBL
LigandPNGBDBM50293265(CHEMBL4162640)
Affinity DataEC50: >1.00E+4nM. Assay description: Agonist activity at mouse TAAR5 expressed in HEK293 cells assessed as cAMP accumulation after 20 mins by BRET assay
In DepthDetails ArticlePubMed
TargetTrace amine-associated receptor 1(Mus musculus (Mouse))
University Of Genoa
Curated by ChEMBL
LigandPNGBDBM50293265(CHEMBL4162640)
Affinity DataEC50:  9.00E+3nM. Assay description: Agonist activity at mouse TAAR1 expressed in HEK293 cells assessed as cAMP accumulation after 20 mins by BRET assay
In DepthDetails ArticlePubMed