BDBM50293376 CHEMBL4163065
SMILES Cl.Cl.NC(=N)\N=C(/N)N1CCN(CC1)c1cccc(Cl)c1
InChI Key InChIKey=FGQLBXCQLKPUDF-UHFFFAOYSA-N
Data  1 EC50
  Tab Delimited (TSV)   2D SDfile   Computed 3D by Vconf -m prep SDfile
Find this compound or compounds like it in BindingDB:
Activity Spreadsheet -- Enzyme Inhibition Constant Data from BindingDB
Found 1 hit for monomerid = 50293376
TargetTrace amine-associated receptor 5(Mus musculus)
University Of Genoa
Curated by ChEMBL
LigandPNGBDBM50293376(CHEMBL4163065)
Affinity DataEC50: >1.00E+4nM. Assay description: Inhibition of very late antigen 4 expressed in Jurkat cell line, in a cell-based adhesion assay
In DepthDetails ArticlePubMed