BDBM50293457 (R)-4-((1-(benzo[d][1,3]dioxol-5-ylmethyl)piperidin-4-yl)methyl)-N-(1-phenylethyl)benzamide::CHEMBL538215
SMILES C[C@@H](NC(=O)c1ccc(CC2CCN(Cc3ccc4OCOc4c3)CC2)cc1)c1ccccc1
InChI Key InChIKey=FILSLSBYZHHHLD-OAQYLSRUSA-N
Data  2 KI
  Tab Delimited (TSV)   2D SDfile   Computed 3D by Vconf -m prep SDfile
Find this compound or compounds like it in BindingDB:
Activity Spreadsheet -- Enzyme Inhibition Constant Data from BindingDB
Found 2 hits for monomerid = 50293457
TargetMelanin-concentrating hormone receptor 1(Homo sapiens (Human))
University Of Jordan
Curated by ChEMBL
LigandPNGBDBM50293457((R)-4-((1-(benzo[d][1,3]dioxol-5-ylmethyl)piperidi...)
Affinity DataKi:  3.47E+3nM. Assay description: Binding affinity to MCH1 receptor
In DepthDetails ArticlePubMed
TargetMelanin-concentrating hormone receptor 1(Homo sapiens (Human))
University Of Jordan
Curated by ChEMBL
LigandPNGBDBM50293457((R)-4-((1-(benzo[d][1,3]dioxol-5-ylmethyl)piperidi...)
Affinity DataKi:  4.14E+3nM. Assay description: Binding affinity to MCH1 receptor
In DepthDetails ArticlePubMed