BDBM50293473 (R)-4-((1-(benzo[d][1,3]dioxol-5-ylmethyl)piperidin-4-yl)methyl)-N-(1-(4-chlorophenyl)ethyl)benzamide::CHEMBL538968
SMILES C[C@@H](NC(=O)c1ccc(CC2CCN(Cc3ccc4OCOc4c3)CC2)cc1)c1ccc(Cl)cc1
InChI Key InChIKey=JPFPCRQLYBJTOX-HXUWFJFHSA-N
Data  1 KI
  Tab Delimited (TSV)   2D SDfile   Computed 3D by Vconf -m prep SDfile
Find this compound or compounds like it in BindingDB:
Activity Spreadsheet -- Enzyme Inhibition Constant Data from BindingDB
Found 1 hit for monomerid = 50293473
TargetMelanin-concentrating hormone receptor 1(Homo sapiens (Human))
University Of Jordan
Curated by ChEMBL
LigandPNGBDBM50293473((R)-4-((1-(benzo[d][1,3]dioxol-5-ylmethyl)piperidi...)
Affinity DataKi:  108nM. Assay description: Binding affinity to MCH1 receptor
In DepthDetails ArticlePubMed