BDBM50295541 4-(3-(4-(methylsulfonyl)phenyl)-1,2,4-oxadiazol-5-yl)-N-(2-phenylcyclopropyl)piperidine-1-carboxamide::CHEMBL551058
SMILES CS(=O)(=O)c1ccc(cc1)-c1noc(n1)C1CCN(CC1)C(=O)NC1CC1c1ccccc1
InChI Key InChIKey=PPZAIZWNHZKGPM-UHFFFAOYSA-N
Data  10 IC50
  Tab Delimited (TSV)   2D SDfile   Computed 3D by Vconf -m prep SDfile
Find this compound or compounds like it in BindingDB:
Activity Spreadsheet -- Enzyme Inhibition Constant Data from BindingDB
Found 10 hits for monomerid = 50295541
TargetBifunctional epoxide hydrolase 2(Homo sapiens (Human))
Merck Research Laboratories
Curated by ChEMBL
LigandPNGBDBM50295541(4-(3-(4-(methylsulfonyl)phenyl)-1,2,4-oxadiazol-5-...)
Affinity DataIC50:  11nM. Assay description: Inhibition of human sEH in HEK293 cells assessed as conversion of 14,15-epoxyeicosatrienoic acid to 14,15-dihydroepoxyeicosatrienoic acid
In DepthDetails ArticlePubMed
TargetEpoxide hydrolase 1(Homo sapiens (Human))
Merck Research Laboratories
Curated by ChEMBL
LigandPNGBDBM50295541(4-(3-(4-(methylsulfonyl)phenyl)-1,2,4-oxadiazol-5-...)
Affinity DataIC50:  4.20E+4nM. Assay description: Inhibition of human mEH
In DepthDetails ArticlePubMed
TargetCytochrome P450 2C9(Homo sapiens (Human))
Merck Research Laboratories
Curated by ChEMBL
LigandPNGBDBM50295541(4-(3-(4-(methylsulfonyl)phenyl)-1,2,4-oxadiazol-5-...)
Affinity DataIC50: >1.00E+4nM. Assay description: Inhibition of CYP2C9
In DepthDetails ArticlePubMed
TargetCytochrome P450 2D6(Homo sapiens (Human))
Merck Research Laboratories
Curated by ChEMBL
LigandPNGBDBM50295541(4-(3-(4-(methylsulfonyl)phenyl)-1,2,4-oxadiazol-5-...)
Affinity DataIC50: >1.00E+4nM. Assay description: Inhibition of CYP2D6
In DepthDetails ArticlePubMed
TargetBifunctional epoxide hydrolase 2(Rattus norvegicus)
Merck Research Laboratories
Curated by ChEMBL
LigandPNGBDBM50295541(4-(3-(4-(methylsulfonyl)phenyl)-1,2,4-oxadiazol-5-...)
Affinity DataIC50:  12nM. Assay description: Inhibition of rat sEH
In DepthDetails ArticlePubMed
TargetVoltage-dependent L-type calcium channel subunit alpha-1C(Homo sapiens (Human))
Merck Research Laboratories
Curated by ChEMBL
LigandPNGBDBM50295541(4-(3-(4-(methylsulfonyl)phenyl)-1,2,4-oxadiazol-5-...)
Affinity DataIC50: >3.00E+4nM. Assay description: Inhibition of Cav 1.2 channel
In DepthDetails ArticlePubMed
TargetPotassium voltage-gated channel subfamily H member 2(Homo sapiens (Human))
Merck Research Laboratories
Curated by ChEMBL
LigandPNGBDBM50295541(4-(3-(4-(methylsulfonyl)phenyl)-1,2,4-oxadiazol-5-...)
Affinity DataIC50:  9.00E+3nM. Assay description: Inhibition of IKr channel
In DepthDetails ArticlePubMed
TargetSodium channel protein type 5 subunit alpha(Homo sapiens (Human))
Merck Research Laboratories
Curated by ChEMBL
LigandPNGBDBM50295541(4-(3-(4-(methylsulfonyl)phenyl)-1,2,4-oxadiazol-5-...)
Affinity DataIC50: >1.00E+4nM. Assay description: Inhibition of Nav1.5 channel
In DepthDetails ArticlePubMed
TargetBifunctional epoxide hydrolase 2(Homo sapiens (Human))
Merck Research Laboratories
Curated by ChEMBL
LigandPNGBDBM50295541(4-(3-(4-(methylsulfonyl)phenyl)-1,2,4-oxadiazol-5-...)
Affinity DataIC50:  4nM. Assay description: Inhibition of human sEH
In DepthDetails ArticlePubMed
TargetCytochrome P450 3A4(Homo sapiens (Human))
Merck Research Laboratories
Curated by ChEMBL
LigandPNGBDBM50295541(4-(3-(4-(methylsulfonyl)phenyl)-1,2,4-oxadiazol-5-...)
Affinity DataIC50: >1.00E+4nM. Assay description: Inhibition of CYP3A4
In DepthDetails ArticlePubMed