BDBM50296287 1-((3S)-1-(2-(2-benzylpyrrolidin-1-yl)-2-oxoethyl)-2-oxoazepan-3-yl)-2-cyano-3-(2-methylbenzofuran-5-yl)guanidine::CHEMBL549836
SMILES Cc1cc2cc(ccc2o1)N=C(NC#N)N[C@H]1CCCCN(CC(=O)N2CCCC2Cc2ccccc2)C1=O
InChI Key InChIKey=MNJQDWYUMIJHDJ-AMVUTOCUSA-N
Data  1 IC50
  Tab Delimited (TSV)   2D SDfile   Computed 3D by Vconf -m prep SDfile
Find this compound or compounds like it in BindingDB:
Activity Spreadsheet -- Enzyme Inhibition Constant Data from BindingDB
Found 1 hit for monomerid = 50296287
TargetCoagulation factor X(Homo sapiens (Human))
Bristol-Myers Squibb
Curated by ChEMBL
LigandPNGBDBM50296287(1-((3S)-1-(2-(2-benzylpyrrolidin-1-yl)-2-oxoethyl)...)
Affinity DataIC50:  19nM. Assay description: Inhibition of human factor 10a-mediated cleavage of synthetic substrate S-2222
In DepthDetails ArticlePubMed