BDBM50296576 2-(3-chloro-5-methylphenyl)-1H-indole-5-carboximidamide::CHEMBL563745
SMILES Cc1cc(Cl)cc(c1)-c1cc2cc(ccc2[nH]1)C(N)=N
InChI Key InChIKey=BGMVUCABLHEDJF-UHFFFAOYSA-N
Data  1 IC50
  Tab Delimited (TSV)   2D SDfile   Computed 3D by Vconf -m prep SDfile
Find this compound or compounds like it in BindingDB:
Activity Spreadsheet -- Enzyme Inhibition Constant Data from BindingDB
Found 1 hit for monomerid = 50296576
TargetAcid-sensing ion channel 3(Homo sapiens (Human))
Merck
Curated by ChEMBL
LigandPNGBDBM50296576(2-(3-chloro-5-methylphenyl)-1H-indole-5-carboximid...)
Affinity DataIC50:  5.10E+4nM. Assay description: Inhibition of ASIC3 by patch-clamp electrophysiology assay
In DepthDetails ArticlePubMed